Target
Serine/threonine-protein kinase PLK4
Ligand
BDBM25119
Substrate
Biotinylated Peptide A-A11
Meas. Tech.
PLK Kinase Assay
Ki
970±n/a nM
Citation
 Johnson, EFStewart, KDWoods, KWGiranda, VLLuo, Y Pharmacological and functional comparison of the polo-like kinase family: insight into inhibitor and substrate specificity. Biochemistry 46:9551-63 (2007)  
Target
Name:
Serine/threonine-protein kinase PLK4
Synonyms:
PLK4 Polo-Like Kinase 4 STK18 | Serine/threonine-protein kinase PLK4
Type:
PROTEIN
Mol. Mass.:
108996.91
Organism:
Homo sapiens (Human)
Description:
ChEMBL_1474078
Residue:
970
  
Inhibitor
Name:
BDBM25119
Synonyms:
(3E)-5-(5-{[(2S)-2-amino-3-(1H-indol-3-yl)propyl]oxy}pyridin-3-yl)-3-(furan-2-ylmethylidene)-1,3-dihydro-2H-indol-2-one dihydroindol-2-one, 13
Type:
Small organic molecule
Emp. Form.:
C29H24N4O3
Mol. Mass.:
476.5259
SMILES:
N[C@H](COc1cncc(c1)-c1ccc2NC(=O)\C(=C\c3ccco3)c2c1)Cc1c[nH]c2ccccc12
:
Substrate
Name:
Biotinylated Peptide A-A11
Synonyms:
Type:
Peptide
Mol. Mass.:
1379.40
Organism:
Description:
Residue:
13
TPSDSLIYDDGLS