Target
Nuclear receptor ROR-gamma
Ligand
BDBM383125
Substrate
Meas. Tech.
General RORgamma SPA binding assay
IC50
56.0±n/a nM
Citation
 Duan, JDhar, TGMarcoux, DCherney, RJ Tricyclic sulfones as RORγ modulators US Patent  US10273259 Publication Date 4/30/2019 
Target
Name:
Nuclear receptor ROR-gamma
Synonyms:
Nr1f3 Nuclear receptor subfamily 1 group F member 3 RORG_MOUSE Rorc TOR Thymus orphan receptor
Type:
PROTEIN
Mol. Mass.:
58133.31
Organism:
Mus musculus
Description:
ChEMBL_103664
Residue:
516
  
Inhibitor
Name:
BDBM383125
Synonyms:
(1R,2S)-4-(9b-((3-fluorophenyl)sulfonyl)-7-(perfluoropropan-2-yl)-2,3,3a,4,5,9b-hexahydro-1H-benzo[e]indole-3-carbonyl)-2-methylcyclohexane-1-carboxylic acid (2 Single Diastereomers) US10273259, Example 837 | US10711020, Example 837
Type:
Small organic molecule
Emp. Form.:
C30H29F8NO5S
Mol. Mass.:
667.607
SMILES:
C[C@H]1CC(CC[C@H]1C(O)=O)C(=O)N1CCC2(C1CCc1cc(ccc21)C(F)(C(F)(F)F)C(F)(F)F)S(=O)(=O)c1cccc(F)c1
: