Target
Glutaminase kidney isoform, mitochondrial
Ligand
BDBM383193
Substrate
Meas. Tech.
Recombinant Enzyme Assa
IC50
16.0±n/a nM
Citation
 Parlati, FOrford, KWhiting, SH Combination therapy with glutaminase inhibitors US Patent  US10278968 Publication Date 5/7/2019 
Target
Name:
Glutaminase kidney isoform, mitochondrial
Synonyms:
GLS GLSK_HUMAN K-glutaminase L-glutamine amidohydrolase
Type:
Protein
Mol. Mass.:
73471.89
Organism:
Homo sapiens (Human)
Description:
O94925
Residue:
669
  
Inhibitor
Name:
BDBM383193
Synonyms:
US10278968, Compound 721 | US10793535, Cmpd ID 721
Type:
Small organic molecule
Emp. Form.:
C26H23ClF3N7O3S
Mol. Mass.:
606.019
SMILES:
FC(F)(F)Oc1cc(CC(=O)Nc2ccc(CCCCc3nnc(NC(=O)Cc4ccccn4)s3)nn2)ccc1Cl
: