Target
Glutaminase kidney isoform, mitochondrial
Ligand
BDBM109073
Substrate
Meas. Tech.
Recombinant Enzyme Assa
IC50
540±n/a nM
Citation
 Parlati, FOrford, KWhiting, SH Combination therapy with glutaminase inhibitors US Patent  US10278968 Publication Date 5/7/2019 
Target
Name:
Glutaminase kidney isoform, mitochondrial
Synonyms:
GLS GLSK_HUMAN K-glutaminase L-glutamine amidohydrolase
Type:
Protein
Mol. Mass.:
73471.89
Organism:
Homo sapiens (Human)
Description:
O94925
Residue:
669
  
Inhibitor
Name:
BDBM109073
Synonyms:
US10793535, Cmpd ID 726 US9938267, Cmpd ID 657
Type:
Small organic molecule
Emp. Form.:
C19H19F3N6O2S
Mol. Mass.:
452.453
SMILES:
Nc1nnc(CCCCc2ccc(NC(=O)Cc3cccc(OC(F)(F)F)c3)nn2)s1
: