Target
Gag-Pol polyprotein
Ligand
BDBM25336
Substrate
Biotinylated Target DNA
Meas. Tech.
Microtiter Plate Assay for Strand Transfer
pH
7.8±n/a
Temperature
310.15±n/a K
IC50
15±n/a nM
Citation
 Summa, VPetrocchi, ABonelli, FCrescenzi, BDonghi, MFerrara, MFiore, FGardelli, CGonzalez Paz, OHazuda, DJJones, PKinzel, OLaufer, RMonteagudo, EMuraglia, ENizi, EOrvieto, FPace, PPescatore, GScarpelli, RStillmock, KWitmer, MVRowley, M Discovery of raltegravir, a potent, selective orally bioavailable HIV-integrase inhibitor for the treatment of HIV-AIDS infection. J Med Chem 51:5843-55 (2008)  
Target
Name:
Gag-Pol polyprotein
Synonyms:
HIV-1 reverse transcriptase (HIV-1 RT) POL_HV1H2 Protease Reverse transcriptase (RT) gag-pol p66 RT
Type:
Protein
Mol. Mass.:
162074.74
Organism:
Human immunodeficiency virus type 1 group M subtype B (isolate HXB2)
Description:
P04585
Residue:
1435
  
Inhibitor
Name:
BDBM25336
Synonyms:
N-methyl-pyrimidinone derivative, 12 | methyl 0-{[2-(4-{[(4-fluorophenyl)methyl]carbamoyl}-5-hydroxy-1-methyl-6-oxo-1,6-dihydropyrimidin-2-yl)propan-2-yl]carbamoyl}formate
Type:
Small organic molecule
Emp. Form.:
C19H21FN4O6
Mol. Mass.:
420.3916
SMILES:
COC(=O)C(=O)NC(C)(C)c1nc(C(=O)NCc2ccc(F)cc2)c(O)c(=O)n1C
:
Substrate
Name:
Biotinylated Target DNA
Synonyms:
3-biotinylated-poly d(GT)10/poly d(CA)10
Type:
Duplex DNA
Mol. Mass.:
358.43
Organism:
Description:
The synthesized HIV long terminal repeat (LTR) sequence ligonucleotides (~30 bp) as the donor substrates were immobilized on microtiter plates in strand transfer assay.
Residue:
3
NA