Target
Mitogen-activated protein kinase 1
Ligand
BDBM365026
Substrate
Meas. Tech.
ERK-2 Enzymatic Assay
IC50
<0.020±n/a nM
Citation
 Kolesnikov, ADo, S Serine/threonine kinase inhibitors US Patent  US10278975 Publication Date 5/7/2019 
Target
Name:
Mitogen-activated protein kinase 1
Synonyms:
ERK2 Extracellular signal-regulated kinase 2 Extracellular signal-regulated kinase 2 (ERK2) MAPK 2 MK01_HUMAN Mitogen-activated protein kinase 1 (ERK-2) Mitogen-activated protein kinase 2 PRKM2 | p42-MAPK
Type:
Ser/Thr Protein Kinase
Mol. Mass.:
41392.76
Organism:
Homo sapiens (Human)
Description:
P28482
Residue:
360
  
Inhibitor
Name:
BDBM365026
Synonyms:
N-(1-methyl-1H-pyrazol-5- yl)-4-(3-phenyl-4,5-dihydro- 3H-1,2,2a1,5- tetraazaacenaphthylen-7- yl)pyridin-2-amine US11376260, Example I-4R | US9867833, Compound I-4(R)
Type:
Small organic molecule
Emp. Form.:
C23H20N8
Mol. Mass.:
408.4585
SMILES:
Cn1nccc1Nc1cc(ccn1)-c1cc2NC[C@H](c3nnc(c1)n23)c1ccccc1
: