Target
Mitogen-activated protein kinase 1
Ligand
BDBM383245
Substrate
Meas. Tech.
ERK-2 Enzymatic Assay
IC50
<0.020±n/a nM
Citation
 Kolesnikov, ADo, S Serine/threonine kinase inhibitors US Patent  US10278975 Publication Date 5/7/2019 
Target
Name:
Mitogen-activated protein kinase 1
Synonyms:
ERK2 Extracellular signal-regulated kinase 2 Extracellular signal-regulated kinase 2 (ERK2) MAPK 2 MK01_HUMAN Mitogen-activated protein kinase 1 (ERK-2) Mitogen-activated protein kinase 2 PRKM2 | p42-MAPK
Type:
Ser/Thr Protein Kinase
Mol. Mass.:
41392.76
Organism:
Homo sapiens (Human)
Description:
P28482
Residue:
360
  
Inhibitor
Name:
BDBM383245
Synonyms:
4-(3-((6-methoxypyridin-3- yl)methyl)-4,5-dihydro3H- 1,2,2a1,5- tetraazaacenaphthylen-7-yl)- N-(1-methyl-1H-pyrazol-5- yl)pyrimidin-2-amine US11376260, Example I-24S
Type:
Small organic molecule
Emp. Form.:
C23H22N10O
Mol. Mass.:
454.4872
SMILES:
COc1ccc(C[C@H]2CNc3cc(cc4nnc2n34)-c2ccnc(Nc3ccnn3C)n2)cn1
: