Target
Mitogen-activated protein kinase 1
Ligand
BDBM383251
Substrate
Meas. Tech.
ERK-2 Enzymatic Assay
IC50
<0.020±n/a nM
Citation
 Kolesnikov, ADo, S Serine/threonine kinase inhibitors US Patent  US10278975 Publication Date 5/7/2019 
Target
Name:
Mitogen-activated protein kinase 1
Synonyms:
ERK2 Extracellular signal-regulated kinase 2 Extracellular signal-regulated kinase 2 (ERK2) MAPK 2 MK01_HUMAN Mitogen-activated protein kinase 1 (ERK-2) Mitogen-activated protein kinase 2 PRKM2 | p42-MAPK
Type:
Ser/Thr Protein Kinase
Mol. Mass.:
41392.76
Organism:
Homo sapiens (Human)
Description:
P28482
Residue:
360
  
Inhibitor
Name:
BDBM383251
Synonyms:
4-(9-((benzyloxy)methyl)- 8,9-dihydro-7H-6-oxa- 1,2,2a1- triazabenzo[cd]azulen-4-yl)- N-(1-methyl-1H-pyrazol-5- yl)pyrimidin-2-amine US11376260, Example I-29S
Type:
Small organic molecule
Emp. Form.:
C25H24N8O2
Mol. Mass.:
468.5105
SMILES:
Cn1nccc1Nc1nccc(n1)-c1cc2OCC[C@H](COCc3ccccc3)c3nnc(c1)n23
: