Target
Mitogen-activated protein kinase 1
Ligand
BDBM365154
Substrate
Meas. Tech.
ERK-2 Enzymatic Assay
IC50
<0.020±n/a nM
Citation
 Kolesnikov, ADo, S Serine/threonine kinase inhibitors US Patent  US10278975 Publication Date 5/7/2019 
Target
Name:
Mitogen-activated protein kinase 1
Synonyms:
ERK2 Extracellular signal-regulated kinase 2 Extracellular signal-regulated kinase 2 (ERK2) MAPK 2 MK01_HUMAN Mitogen-activated protein kinase 1 (ERK-2) Mitogen-activated protein kinase 2 PRKM2 | p42-MAPK
Type:
Ser/Thr Protein Kinase
Mol. Mass.:
41392.76
Organism:
Homo sapiens (Human)
Description:
P28482
Residue:
360
  
Inhibitor
Name:
BDBM365154
Synonyms:
4-(3-benzyl-4-methyl-3,4- dihydro-5-oxa-1,2,2a1- triazaacenaphthylen-7-yl)-N- (1-methyl-1H-pyrazol-5- yl)pyrimidin-2-amine US10517878, Compound I-76 US11376260, Example I-763S | US9867833, Compound I-76(3S,4S)
Type:
Small organic molecule
Emp. Form.:
C24H22N8O
Mol. Mass.:
438.4845
SMILES:
C[C@H]1Oc2cc(cc3nnc([C@H]1Cc1ccccc1)n23)-c1ccnc(Nc2ccnn2C)n1
: