Target
Mitogen-activated protein kinase 1
Ligand
BDBM383345
Substrate
Meas. Tech.
ERK-2 Enzymatic Assay
IC50
<0.020±n/a nM
Citation
 Kolesnikov, ADo, S Serine/threonine kinase inhibitors US Patent  US10278975 Publication Date 5/7/2019 
Target
Name:
Mitogen-activated protein kinase 1
Synonyms:
ERK2 Extracellular signal-regulated kinase 2 Extracellular signal-regulated kinase 2 (ERK2) MAPK 2 MK01_HUMAN Mitogen-activated protein kinase 1 (ERK-2) Mitogen-activated protein kinase 2 PRKM2 | p42-MAPK
Type:
Ser/Thr Protein Kinase
Mol. Mass.:
41392.76
Organism:
Homo sapiens (Human)
Description:
P28482
Residue:
360
  
Inhibitor
Name:
BDBM383345
Synonyms:
9-(2-fluoro-4- methoxybenzyl)-6-methyl-4- (2-((1-methyl-1H-pyrazol-5- yl)amino)pyrimidin-4-yl)-8,9- dihydro-1,2,2a1,6- tetraazabenzo[cd]azulen- 7(6H)-one US11376260, Example I-85S
Type:
Small organic molecule
Emp. Form.:
C26H24FN9O2
Mol. Mass.:
513.5263
SMILES:
COc1ccc(C[C@H]2CC(=O)N(C)c3cc(cc4nnc2n34)-c2ccnc(Nc3ccnn3C)n2)c(F)c1
: