Target
Mitogen-activated protein kinase 1
Ligand
BDBM365174
Substrate
Meas. Tech.
ERK-2 Enzymatic Assay
IC50
6.36±n/a nM
Citation
 Kolesnikov, ADo, S Serine/threonine kinase inhibitors US Patent  US10278975 Publication Date 5/7/2019 
Target
Name:
Mitogen-activated protein kinase 1
Synonyms:
ERK2 Extracellular signal-regulated kinase 2 Extracellular signal-regulated kinase 2 (ERK2) MAPK 2 MK01_HUMAN Mitogen-activated protein kinase 1 (ERK-2) Mitogen-activated protein kinase 2 PRKM2 | p42-MAPK
Type:
Ser/Thr Protein Kinase
Mol. Mass.:
41392.76
Organism:
Homo sapiens (Human)
Description:
P28482
Residue:
360
  
Inhibitor
Name:
BDBM365174
Synonyms:
4-(3-(3-chlorobenzyl)-3,4- dihydro-5-oxa-1,2,2a1- triazaacenaphthylen-7-yl)-N- (1-methyl-1H-pyrazol-5- yl)pyrimidin-2-amine US11376260, Example I-88S | US9867833, Compound I-88(R)
Type:
Small organic molecule
Emp. Form.:
C23H19ClN8O
Mol. Mass.:
458.903
SMILES:
Cn1nccc1Nc1nccc(n1)-c1cc2OC[C@@H](Cc3cccc(Cl)c3)c3nnc(c1)n23
: