Target
Mitogen-activated protein kinase 1
Ligand
BDBM365184
Substrate
Meas. Tech.
ERK-2 Enzymatic Assay
IC50
<0.020±n/a nM
Citation
 Kolesnikov, ADo, S Serine/threonine kinase inhibitors US Patent  US10278975 Publication Date 5/7/2019 
Target
Name:
Mitogen-activated protein kinase 1
Synonyms:
ERK2 Extracellular signal-regulated kinase 2 Extracellular signal-regulated kinase 2 (ERK2) MAPK 2 MK01_HUMAN Mitogen-activated protein kinase 1 (ERK-2) Mitogen-activated protein kinase 2 PRKM2 | p42-MAPK
Type:
Ser/Thr Protein Kinase
Mol. Mass.:
41392.76
Organism:
Homo sapiens (Human)
Description:
P28482
Residue:
360
  
Inhibitor
Name:
BDBM365184
Synonyms:
N-(1-methyl-1H-pyrazol-5- yl)-4-(9-((3-methylisoxazol- 5-yl)methyl)-8,9-dihydro-7H- 6-oxa-1,2,2a1- triazabenzo[cd]azulen-4- yl)pyrimidin-2-amine US11376260, Example I-93S | US9867833, Compound I-93(R)
Type:
Small organic molecule
Emp. Form.:
C22H21N9O2
Mol. Mass.:
443.4612
SMILES:
Cc1cc(C[C@@H]2CCOc3cc(cc4nnc2n34)-c2ccnc(Nc3ccnn3C)n2)on1
: