Target
Mitogen-activated protein kinase 1
Ligand
BDBM365188
Substrate
Meas. Tech.
ERK-2 Enzymatic Assay
IC50
<0.020±n/a nM
Citation
 Kolesnikov, ADo, S Serine/threonine kinase inhibitors US Patent  US10278975 Publication Date 5/7/2019 
Target
Name:
Mitogen-activated protein kinase 1
Synonyms:
ERK2 Extracellular signal-regulated kinase 2 Extracellular signal-regulated kinase 2 (ERK2) MAPK 2 MK01_HUMAN Mitogen-activated protein kinase 1 (ERK-2) Mitogen-activated protein kinase 2 PRKM2 | p42-MAPK
Type:
Ser/Thr Protein Kinase
Mol. Mass.:
41392.76
Organism:
Homo sapiens (Human)
Description:
P28482
Residue:
360
  
Inhibitor
Name:
BDBM365188
Synonyms:
4-(3-(3-methoxybenzyl)-3,4- dihydro-5-oxa-1,2,2a1- triazaacenaphthylen-7-yl)-N- (1-methyl-1H-pyrazol-5- yl)pyridin-2-amine US11376260, Example I-97S | US9867833, Compound I-97(R)
Type:
Small organic molecule
Emp. Form.:
C25H23N7O2
Mol. Mass.:
453.4958
SMILES:
COc1cccc(C[C@@H]2COc3cc(cc4nnc2n34)-c2ccnc(Nc3ccnn3C)c2)c1
: