Target
Tyrosine-protein kinase BTK
Ligand
BDBM384286
Substrate
Meas. Tech.
In Vitro BTK Kinase Activity
IC50
550±n/a nM
Citation
 Friedman, MMCox, PFrank, KEHoemann, MZOsuma, AWilson, NSXu, XCusack, KHuntley, RHerold, JM Heterocyclic kinase inhibitors US Patent  US10280184 Publication Date 5/7/2019 
Target
Name:
Tyrosine-protein kinase BTK
Synonyms:
AGMX1 Agammaglobulinaemia tyrosine kinase B cell progenitor kinase BPK BTK_HUMAN Tyrosine Kinase BTK Tyrosine-protein kinase BTK (BTK)
Type:
Enzyme
Mol. Mass.:
76289.95
Organism:
Homo sapiens (Human)
Description:
Q06187
Residue:
659
  
Inhibitor
Name:
BDBM384286
Synonyms:
US10280184, Example I.1.4
Type:
Small organic molecule
Emp. Form.:
C17H20N8
Mol. Mass.:
336.3943
SMILES:
Cn1ccc(Nc2cc(cn3ncnc23)[C@H]2CCC[C@@H](C2)NC#N)n1
: