Target
Leucine-rich repeat serine/threonine-protein kinase 2 [G2019S]
Ligand
BDBM384312
Substrate
Meas. Tech.
Biochemical Assay
IC50
<30±n/a nM
Citation
 Estrada, AAFeng, JALyssikatos, JPSweeney, ZKde Vicente Fidalgo, J Compounds, compositions, and methods US Patent  US9932325 Publication Date 4/3/2018 
Target
Name:
Leucine-rich repeat serine/threonine-protein kinase 2 [G2019S]
Synonyms:
LRRK2 LRRK2_HUMAN Leucine-rich repeat serine/threonine-protein kinase 2 (LRRK2)(G2019S) PARK8
Type:
Mol. Mass.:
286143.23
Organism:
Homo sapiens (Human)
Description:
Q5S007(G2019S)
Residue:
2527
  
Inhibitor
Name:
BDBM384312
Synonyms:
US10590114, No. 16 US11591316, Compound 16 | US9932325, Example 16
Type:
Small organic molecule
Emp. Form.:
C14H15F3N6O
Mol. Mass.:
340.3037
SMILES:
CNc1nc(Nc2cnn3CC4(COC4)Cc23)ncc1C(F)(F)F
: