Target
Cannabinoid receptor 1
Ligand
BDBM259973
Substrate
Meas. Tech.
cAMP Assay
Temperature
310.15±n/a K
EC50
>10000±n/a nM
Comments
extracted
Citation
 Grether, UKimbara, ANettekoven, MRicklin, FRoever, SRogers-Evans, MSchulz-Gasch, T Pyrazol derivatives US Patent  US9694012 Publication Date 7/4/2017 
Target
Name:
Cannabinoid receptor 1
Synonyms:
CANN6 CB-R CNR CNR1_HUMAN Cannabinoid receptor Cannabinoid receptor 1 (brain)
Type:
G Protein-Coupled Receptor (GPCR)
Mol. Mass.:
52868.96
Organism:
Homo sapiens (Human)
Description:
P21554
Residue:
472
  
Inhibitor
Name:
BDBM259973
Synonyms:
US9512132, 9
Type:
Small organic molecule
Emp. Form.:
C17H21F2N7O
Mol. Mass.:
377.3917
SMILES:
Cc1nonc1Cn1ncc2c(nc(nc12)C(C)(C)C)N1CCC(F)(F)C1
: