Target
Cannabinoid receptor 1
Ligand
BDBM259976
Substrate
Meas. Tech.
cAMP Assay
Temperature
310.15±n/a K
EC50
1574±n/a nM
Comments
extracted
Citation
 Grether, UKimbara, ANettekoven, MRicklin, FRoever, SRogers-Evans, MSchulz-Gasch, T Pyrazol derivatives US Patent  US9694012 Publication Date 7/4/2017 
Target
Name:
Cannabinoid receptor 1
Synonyms:
CANN6 CB-R CNR CNR1_HUMAN Cannabinoid receptor Cannabinoid receptor 1 (brain)
Type:
G Protein-Coupled Receptor (GPCR)
Mol. Mass.:
52868.96
Organism:
Homo sapiens (Human)
Description:
P21554
Residue:
472
  
Inhibitor
Name:
BDBM259976
Synonyms:
US9512132, 12
Type:
Small organic molecule
Emp. Form.:
C19H21ClF2N6
Mol. Mass.:
406.86
SMILES:
CC(C)(C)c1nc(N2CCC(F)(F)C2)c2cnn(Cc3cccnc3Cl)c2n1
: