Target
Cannabinoid receptor 1
Ligand
BDBM259977
Substrate
Meas. Tech.
cAMP Assay
Temperature
310.15±n/a K
EC50
>10000±n/a nM
Comments
extracted
Citation
 Grether, UKimbara, ANettekoven, MRicklin, FRoever, SRogers-Evans, MSchulz-Gasch, T Pyrazol derivatives US Patent  US9694012 Publication Date 7/4/2017 
Target
Name:
Cannabinoid receptor 1
Synonyms:
CANN6 CB-R CNR CNR1_HUMAN Cannabinoid receptor Cannabinoid receptor 1 (brain)
Type:
G Protein-Coupled Receptor (GPCR)
Mol. Mass.:
52868.96
Organism:
Homo sapiens (Human)
Description:
P21554
Residue:
472
  
Inhibitor
Name:
BDBM259977
Synonyms:
US9512132, 13
Type:
Small organic molecule
Emp. Form.:
C16H21F2N5O2S
Mol. Mass.:
385.432
SMILES:
CC(C)(C)c1nc(N2CCC(F)(F)C2)c2cnn(C3CS(=O)(=O)C3)c2n1
: