Target
Cannabinoid receptor 2
Ligand
BDBM259981
Substrate
Meas. Tech.
cAMP Assay
Temperature
310.15±n/a K
EC50
3.0±n/a nM
Comments
extracted
Citation
 Grether, UKimbara, ANettekoven, MRicklin, FRoever, SRogers-Evans, MSchulz-Gasch, T Pyrazol derivatives US Patent  US9694012 Publication Date 7/4/2017 
Target
Name:
Cannabinoid receptor 2
Synonyms:
CANNABINOID CB2 CB2 CB2B CNR2_HUMAN Cannabinoid CB2 receptor Cannabinoid receptor 2 (CB2R) | hCB2
Type:
G Protein-Coupled Receptor (GPCR)
Mol. Mass.:
39690.94
Organism:
Homo sapiens (Human)
Description:
P34972
Residue:
360
  
Inhibitor
Name:
BDBM259981
Synonyms:
US9512132, 17
Type:
Small organic molecule
Emp. Form.:
C18H24F2N8
Mol. Mass.:
390.4336
SMILES:
Cc1nnc(Cn2ncc3c(nc(nc23)C(C)(C)C)N2CCC(F)(F)C2)n1C
: