Target
Caspase-7
Ligand
BDBM222
Substrate
Caspase-7 Fluorometric Substrate Ac-Asp-Glu-Val-Asp-AFC
Meas. Tech.
Fluorometric Assay
pH
7.4±n/a
Temperature
298.15±n/a K
Ki
90±n/a nM
Citation
 Choong, ICLew, WLee, DPham, PBurdett, MTLam, JWWiesmann, CLuong, TNFahr, BDeLano, WLMcDowell, RSAllen, DAErlanson, DAGordon, EMO'Brien, T Identification of potent and selective small-molecule inhibitors of caspase-3 through the use of extended tethering and structure-based drug design. J Med Chem 45:5005-22 (2002)  
Target
Name:
Caspase-7
Synonyms:
Apoptotic protease Mch-3 CASP7 CMH-1 MCH3 | caspase 7, apoptosis-related cysteine peptidase
Type:
Enzyme
Mol. Mass.:
34273.91
Organism:
Homo sapiens (Human)
Description:
P55210
Residue:
303
  
Inhibitor
Name:
BDBM222
Synonyms:
(S)-5-({5-[1-Carboxymethyl-3-(2-chloro-benzylsulfanyl)-2-oxo-propylcarbamoyl]pyridin-2-ylmethyl}sulfamoyl)-2-hydroxy-benzoic Acid Pyridine Scaffold 59
Type:
Small organic molecule
Emp. Form.:
C26H24ClN3O9S2
Mol. Mass.:
622.066
SMILES:
OC(=O)C[C@H](NC(=O)c1ccc(CNS(=O)(=O)c2ccc(O)c(c2)C(O)=O)nc1)C(=O)CSCc1ccccc1Cl
:
Substrate
Name:
Caspase-7 Fluorometric Substrate Ac-Asp-Glu-Val-Asp-AFC
Synonyms:
Ac-DEVD-AFC Fluorometric Tetrapeptide Ac-DEVD-AMC
Type:
Peptide
Mol. Mass.:
473.41
Organism:
Description:
Molecular Mass of DEVD
Residue:
4
DEVD