Target
Proto-oncogene Wnt-1
Ligand
BDBM384681
Substrate
Meas. Tech.
The screening assay for Wnt activity
EC50
>10000±n/a nM
Citation
 KC, SKWallace, DMCao, JChiruta, CHood, J 3-(1H-pyrrolo[2,3-B]pyridin-2-yl)-1H-pyrazolo[3,4-C]pyridines and therapeutic uses thereof US Patent  US10285982 Publication Date 5/14/2019 
Target
Name:
Proto-oncogene Wnt-1
Synonyms:
INT1 WNT1 | WNT1_HUMAN
Type:
Enzyme Catalytic Domain
Mol. Mass.:
41006.01
Organism:
Homo sapiens (human)
Description:
P04628
Residue:
370
  
Inhibitor
Name:
BDBM384681
Synonyms:
US10285982, Compound 117
Type:
Small organic molecule
Emp. Form.:
C24H17N7
Mol. Mass.:
403.4387
SMILES:
Cc1ccncc1-c1cc2c(n[nH]c2cn1)-c1cc2c(ccnc2[nH]1)-c1ccncc1
: