Target
Proto-oncogene Wnt-1
Ligand
BDBM384780
Substrate
Meas. Tech.
The screening assay for Wnt activity
EC50
>10000±n/a nM
Citation
 KC, SKWallace, DMCao, JChiruta, CHood, J 3-(1H-pyrrolo[2,3-B]pyridin-2-yl)-1H-pyrazolo[3,4-B] pyridines and therapeutic uses thereof US Patent  US10285983 Publication Date 5/14/2019 
Target
Name:
Proto-oncogene Wnt-1
Synonyms:
INT1 WNT1 | WNT1_HUMAN
Type:
Enzyme Catalytic Domain
Mol. Mass.:
41006.01
Organism:
Homo sapiens (human)
Description:
P04628
Residue:
370
  
Inhibitor
Name:
BDBM384780
Synonyms:
US10285983, Compound 533
Type:
Small organic molecule
Emp. Form.:
C24H15FN6O
Mol. Mass.:
422.4139
SMILES:
Oc1cncc(c1)-c1cnc2[nH]nc(-c3cc4c(ccnc4[nH]3)-c3ccc(F)cc3)c2c1
: