Target
Phosphodiesterase
Ligand
BDBM384855
Substrate
Meas. Tech.
PDE2 Assay B
Ki
0.230±n/a nM
Citation
 Shen, DWang, DQian, XHarper, BYang, MBo, Y Pyrimidinone amide compounds as PDE2 inhibitors US Patent  US10285989 Publication Date 5/14/2019 
Target
Name:
Phosphodiesterase
Synonyms:
PDE2A3 | Phosphodiesterase A3 (PDE2A3)
Type:
Enzyme Catalytic Domain
Mol. Mass.:
105547.91
Organism:
Macaca mulatta (Rhesus macaque)
Description:
Residue:
941
  
Inhibitor
Name:
BDBM384855
Synonyms:
N-[(R)-(4-cyclopropylphenyl)(1- methylcyclopropyl)methyl]-2- (dimethylamino)-6-oxo-1,6- dihydropyrimidine-4-carboxamide | US10285989, Example 71
Type:
Small organic molecule
Emp. Form.:
C21H26N4O2
Mol. Mass.:
366.4567
SMILES:
CN(C)c1nc(cc(=O)[nH]1)C(=O)N[C@@H](c1ccc(cc1)C1CC1)C1(C)CC1
: