Target
Serine/threonine-protein kinase B-raf [V600E]
Ligand
BDBM26028
Substrate
MEK Inactive Mutant
Meas. Tech.
RAF Kinase Inhibition Assay
IC50
45±n/a nM
Citation
 Ramurthy, SSubramanian, SAikawa, MAmiri, PCostales, ADove, JFong, SJansen, JMLevine, BMa, SMcBride, CMMichaelian, JPick, TPoon, DJGirish, SShafer, CMStuart, DSung, LRenhowe, PA Design and Synthesis of Orally Bioavailable Benzimidazoles as Raf Kinase Inhibitors. J Med Chem 51:7049-52 (2008)  
Target
Name:
Serine/threonine-protein kinase B-raf [V600E]
Synonyms:
B-RAF V600E B-Raf Protein Kinase Mutant (V600E) BRAF BRAF mutant V600E BRAF_HUMAN Protein mono-ADP-ribosyltransferase (PARP3) RAFB1 Serine/threonine-protein kinase B-raf (V600E) V-RAF murine sarcoma viral oncogene homologue B1 mutant (BRAF V600E)
Type:
Mol. Mass.:
84474.98
Organism:
Homo sapiens (Human)
Description:
P15056 V600E
Residue:
766
  
Inhibitor
Name:
BDBM26028
Synonyms:
4-({2-[(3-tert-butylphenyl)(methyl)amino]-1H-1,3-benzodiazol-5-yl}oxy)-N-methylpyridine-2-carboxamide | arylaminobenzimidazole, 23
Type:
Small organic molecule
Emp. Form.:
C25H27N5O2
Mol. Mass.:
429.5142
SMILES:
CNC(=O)c1cc(Oc2ccc3n(C)c(Nc4cccc(c4)C(C)(C)C)nc3c2)ccn1
:
Substrate
Name:
MEK Inactive Mutant
Synonyms:
Full length kinase dead MEK | kd-MEK
Type:
Other Protein Type
Mol. Mass.:
358.43
Organism:
Description:
Residue:
3
NA