Target
Epidermal growth factor receptor [696-1022,T790M,L858R]
Ligand
BDBM5447
Substrate
BDBM10852
Meas. Tech.
Fluorescence Binding Assay
pH
7.4±n/a
Temperature
295.15±n/a K
Kd
10.9±.6 nM
Citation
 Yun, CHMengwasser, KEToms, AVWoo, MSGreulich, HWong, KKMeyerson, MEck, MJ The T790M mutation in EGFR kinase causes drug resistance by increasing the affinity for ATP. Proc Natl Acad Sci U S A 105:2070-5 (2008)  
Target
Name:
Epidermal growth factor receptor [696-1022,T790M,L858R]
Synonyms:
EGF-R Tyrosine Kinase Mutant (L858R/T790M) EGFR_HUMAN ERBB1 | HER1
Type:
Tyrosine-protein kinase
Mol. Mass.:
37326.85
Organism:
Homo sapiens (Human)
Description:
P00533[696-1022,T790M,L858R]
Residue:
327
  
Inhibitor
Name:
BDBM5447
Synonyms:
CHEMBL939 Iressa N-(3-chloro-4-fluorophenyl)-7-methoxy-6-[3-(morpholin-4-yl)propoxy]quinazolin-4-amine US10507209, Compound Gefitinib US9730934, Gefitinib WO2022090481, Example gefitinib cid_123631
Type:
Small organic molecule
Emp. Form.:
C22H24ClFN4O3
Mol. Mass.:
446.902
SMILES:
COc1cc2ncnc(Nc3ccc(F)c(Cl)c3)c2cc1OCCCN1CCOCC1
:
Substrate