Target
Ribosomal protein S6 kinase beta-1 [T412E]
Ligand
BDBM386001
Substrate
Meas. Tech.
P70S6K Enzyme Assay
IC50
300±n/a nM
Citation
 Lan, RHuck, BRChen, XXiao, Y Heterocyclic derivatives as modulators of kinase activity US Patent  US10287300 Publication Date 5/14/2019 
Target
Name:
Ribosomal protein S6 kinase beta-1 [T412E]
Synonyms:
KS6B1_HUMAN RPS6KB1 p70 ribosomal S6 kinase alpha (P70S6K)(T412E)
Type:
Enzyme Catalytic Domain
Mol. Mass.:
59166.89
Organism:
Homo sapiens (Human)
Description:
P23443[T412E]
Residue:
525
  
Inhibitor
Name:
BDBM386001
Synonyms:
US10287300, Compound A8 | {2-(4-Chlorophenyl)-2-[4-(5,6,7,8-tetrahydro-pyrido[2,3-d]pyrimidin-4-yl)-piperazin-1-yl]-ethyl}-dimethylamine
Type:
Small organic molecule
Emp. Form.:
C21H29ClN6
Mol. Mass.:
400.948
SMILES:
CN(C)CC(N1CCN(CC1)c1ncnc2NCCCc12)c1ccc(Cl)cc1
: