Target
Ribosomal protein S6 kinase beta-1 [T412E]
Ligand
BDBM386006
Substrate
Meas. Tech.
P70S6K Enzyme Assay
IC50
62±n/a nM
Citation
 Lan, RHuck, BRChen, XXiao, Y Heterocyclic derivatives as modulators of kinase activity US Patent  US10287300 Publication Date 5/14/2019 
Target
Name:
Ribosomal protein S6 kinase beta-1 [T412E]
Synonyms:
KS6B1_HUMAN RPS6KB1 p70 ribosomal S6 kinase alpha (P70S6K)(T412E)
Type:
Enzyme Catalytic Domain
Mol. Mass.:
59166.89
Organism:
Homo sapiens (Human)
Description:
P23443[T412E]
Residue:
525
  
Inhibitor
Name:
BDBM386006
Synonyms:
2-(4-Chloro-phenyl)-2-[4-(6,7-dihydro-5H-pyrrolo[2,3-d]pyrimidin-4-yl)-piperazin-1-yl]-ethylamine | US10287300, Compound A13
Type:
Small organic molecule
Emp. Form.:
C18H23ClN6
Mol. Mass.:
358.868
SMILES:
NCC(N1CCN(CC1)c1ncnc2NCCc12)c1ccc(Cl)cc1
: