Target
Ribosomal protein S6 kinase beta-1 [T412E]
Ligand
BDBM386008
Substrate
Meas. Tech.
P70S6K Enzyme Assay
IC50
750±n/a nM
Citation
 Lan, RHuck, BRChen, XXiao, Y Heterocyclic derivatives as modulators of kinase activity US Patent  US10287300 Publication Date 5/14/2019 
Target
Name:
Ribosomal protein S6 kinase beta-1 [T412E]
Synonyms:
KS6B1_HUMAN RPS6KB1 p70 ribosomal S6 kinase alpha (P70S6K)(T412E)
Type:
Enzyme Catalytic Domain
Mol. Mass.:
59166.89
Organism:
Homo sapiens (Human)
Description:
P23443[T412E]
Residue:
525
  
Inhibitor
Name:
BDBM386008
Synonyms:
2-[4-(6,7-Dihydro-5H-pyrrolo[2,3-d]pyrimidin-4-yl)-piperazin-1-yl]-2-(4-fluorophenyl)-ethylamine | US10287300, Compound A14
Type:
Small organic molecule
Emp. Form.:
C18H23FN6
Mol. Mass.:
342.4138
SMILES:
NCC(N1CCN(CC1)c1ncnc2NCCc12)c1ccc(F)cc1
: