Target
Proline-rich AKT1 substrate 1
Ligand
BDBM386016
Substrate
Meas. Tech.
AKT Enzyme Assay
IC50
62±n/a nM
Citation
 Lan, RHuck, BRChen, XXiao, Y Heterocyclic derivatives as modulators of kinase activity US Patent  US10287300 Publication Date 5/14/2019 
Target
Name:
Proline-rich AKT1 substrate 1
Synonyms:
40 kDa proline-rich AKT substrate AKTS1_HUMAN | PRAS40
Type:
PROTEIN
Mol. Mass.:
27368.40
Organism:
Homo sapiens (Human)
Description:
ChEMBL_664853
Residue:
256
  
Inhibitor
Name:
BDBM386016
Synonyms:
2-(4-Fluoro-phenyl)-2-[4-(5,6,7,8-tetrahydro-pyrido[2,3-d]pyrimidin-4-yl)-piperazin-1-yl]-ethylamine | US10287300, Compound A22
Type:
Small organic molecule
Emp. Form.:
C19H25FN6
Mol. Mass.:
356.4404
SMILES:
NCC(N1CCN(CC1)c1ncnc2NCCCc12)c1ccc(F)cc1
: