Target
Ribosomal protein S6 kinase beta-1 [T412E]
Ligand
BDBM386020
Substrate
Meas. Tech.
P70S6K Enzyme Assay
IC50
750±n/a nM
Citation
 Lan, RHuck, BRChen, XXiao, Y Heterocyclic derivatives as modulators of kinase activity US Patent  US10287300 Publication Date 5/14/2019 
Target
Name:
Ribosomal protein S6 kinase beta-1 [T412E]
Synonyms:
KS6B1_HUMAN RPS6KB1 p70 ribosomal S6 kinase alpha (P70S6K)(T412E)
Type:
Enzyme Catalytic Domain
Mol. Mass.:
59166.89
Organism:
Homo sapiens (Human)
Description:
P23443[T412E]
Residue:
525
  
Inhibitor
Name:
BDBM386020
Synonyms:
4-{4-[2-dimethylamino-1-(4-chloro-phenyl)-ethyl]-piperazin-1-yl}-7,8-dihydro-5H-pteridin-6-one | US10287300, Compound A26
Type:
Small organic molecule
Emp. Form.:
C20H26ClN7O
Mol. Mass.:
415.92
SMILES:
CN(C)CC(N1CCN(CC1)c1ncnc2NCC(=O)Nc12)c1ccc(Cl)cc1
: