Target
Proline-rich AKT1 substrate 1
Ligand
BDBM386060
Substrate
Meas. Tech.
AKT Enzyme Assay
IC50
750±n/a nM
Citation
 Lan, RHuck, BRChen, XXiao, Y Heterocyclic derivatives as modulators of kinase activity US Patent  US10287300 Publication Date 5/14/2019 
Target
Name:
Proline-rich AKT1 substrate 1
Synonyms:
40 kDa proline-rich AKT substrate AKTS1_HUMAN | PRAS40
Type:
PROTEIN
Mol. Mass.:
27368.40
Organism:
Homo sapiens (Human)
Description:
ChEMBL_664853
Residue:
256
  
Inhibitor
Name:
BDBM386060
Synonyms:
4-(4-(1-(4-chloro-3-fluorophenyl)-2-(piperidin-1-yl)ethyl)piperazin-1-yl)-7,8-dihydropteridin-6(5H)-one | US10287300, Compound A62
Type:
Small organic molecule
Emp. Form.:
C23H29ClFN7O
Mol. Mass.:
473.974
SMILES:
Fc1cc(ccc1Cl)C(CN1CCCCC1)N1CCN(CC1)c1ncnc2NCC(=O)Nc12
: