Target
Glutaminase kidney isoform, mitochondrial
Ligand
BDBM50400050
Substrate
Meas. Tech.
Recombinant Enzyme Assay
IC50
100.0±n/a nM
Citation
 Li, JChen, LGoyal, BLaidig, GStanton, TFSjogren, EB Heterocyclic inhibitors of glutaminase US Patent  US9938267 Publication Date 4/10/2018 
Target
Name:
Glutaminase kidney isoform, mitochondrial
Synonyms:
GLS GLSK_HUMAN K-glutaminase L-glutamine amidohydrolase
Type:
Protein
Mol. Mass.:
73471.89
Organism:
Homo sapiens (Human)
Description:
O94925
Residue:
669
  
Inhibitor
Name:
BDBM50400050
Synonyms:
CHEMBL2177757 US11191732, Example BPTES US9938267, Cmpd ID 1
Type:
Small organic molecule
Emp. Form.:
C24H24N6O2S3
Mol. Mass.:
524.681
SMILES:
O=C(Cc1ccccc1)Nc1nnc(CCSCCc2nnc(NC(=O)Cc3ccccc3)s2)s1
: