Target
Orexin receptor type 2
Ligand
BDBM387119
Substrate
Meas. Tech.
FLIPR Assay
IC50
1067±n/a nM
Citation
 Kim, RMKuduk, SDLiverton, NZhou, G 6,5-bicyclic octahydropyrrolopyridine orexin receptor antagonists US Patent  US9938276 Publication Date 4/10/2018 
Target
Name:
Orexin receptor type 2
Synonyms:
HCRTR2 OX2R_HUMAN Orexin receptor type 2 (OR-2) Orexin receptor type 2 (OX2R) Ox-2-R | Ox2-R
Type:
Protein
Mol. Mass.:
50710.53
Organism:
Homo sapiens (Human)
Description:
O43614
Residue:
444
  
Inhibitor
Name:
BDBM387119
Synonyms:
(2-(2H-1,2,3-triazol-2-yl)phenyl)((3aR, 7aR)- 1-(imidazo[1,2-a]pyrazin-8-yl)hexahydro-1H- pyrrolo[2,3-c]pyridin-6(2H)-yl)methanone | US9938276, B14
Type:
Small organic molecule
Emp. Form.:
C23H23N7O
Mol. Mass.:
413.475
SMILES:
O=C(N1CC[C@H]2CCN([C@H]2C1)c1nccn2cccc12)c1ccccc1-n1nccn1
: