Target
Orexin receptor type 2
Ligand
BDBM387135
Substrate
Meas. Tech.
FLIPR Assay
IC50
147±n/a nM
Citation
 Kim, RMKuduk, SDLiverton, NZhou, G 6,5-bicyclic octahydropyrrolopyridine orexin receptor antagonists US Patent  US9938276 Publication Date 4/10/2018 
Target
Name:
Orexin receptor type 2
Synonyms:
HCRTR2 OX2R_HUMAN Orexin receptor type 2 (OR-2) Orexin receptor type 2 (OX2R) Ox-2-R | Ox2-R
Type:
Protein
Mol. Mass.:
50710.53
Organism:
Homo sapiens (Human)
Description:
O43614
Residue:
444
  
Inhibitor
Name:
BDBM387135
Synonyms:
US9938276, D1
Type:
Small organic molecule
Emp. Form.:
C21H21F2N5O2
Mol. Mass.:
413.4205
SMILES:
FC(F)COc1ncccc1C(=O)N1CC[C@H]2CCN([C@H]2C1)c1cc(ccn1)C#N
: