Target
Orexin receptor type 2
Ligand
BDBM387148
Substrate
Meas. Tech.
FLIPR Assay
IC50
512±n/a nM
Citation
 Kim, RMKuduk, SDLiverton, NZhou, G 6,5-bicyclic octahydropyrrolopyridine orexin receptor antagonists US Patent  US9938276 Publication Date 4/10/2018 
Target
Name:
Orexin receptor type 2
Synonyms:
HCRTR2 OX2R_HUMAN Orexin receptor type 2 (OR-2) Orexin receptor type 2 (OX2R) Ox-2-R | Ox2-R
Type:
Protein
Mol. Mass.:
50710.53
Organism:
Homo sapiens (Human)
Description:
O43614
Residue:
444
  
Inhibitor
Name:
BDBM387148
Synonyms:
2-[(3aR, 7aR)-6-{[2-(2,2- difluoroethyl)phenyl]carbonyl}octahydro- 1H-pyrrolo[2,3-c]pyridin-1-yl]pyridine-4- carbonitrile | US9938276, E8
Type:
Small organic molecule
Emp. Form.:
C22H22F2N4O
Mol. Mass.:
396.4331
SMILES:
FC(F)Cc1ccccc1C(=O)N1CC[C@H]2CCN([C@H]2C1)c1cc(ccn1)C#N
: