Target
Histamine H4 receptor
Ligand
BDBM26394
Substrate
BDBM7966
Meas. Tech.
Radioligand Binding Assay
pH
7.4±n/a
Temperature
298.15±n/a K
Ki
4.8±1.8 nM
Citation
 Cowart, MDAltenbach, RJLiu, HHsieh, GCDrizin, IMilicic, IMiller, TRWitte, DGWishart, NFix-Stenzel, SRMcPherson, MJAdair, RMWetter, JMBettencourt, BMMarsh, KCSullivan, JPHonore, PEsbenshade, TABrioni, JD Rotationally constrained 2,4-diamino-5,6-disubstituted pyrimidines: a new class of histamine H4 receptor antagonists with improved druglikeness and in vivo efficacy in pain and inflammation models. J Med Chem 51:6547-57 (2008)  
Target
Name:
Histamine H4 receptor
Synonyms:
HH4R Hrh4
Type:
G Protein-Coupled Receptor (GPCR)
Mol. Mass.:
44045.07
Organism:
Rattus norvegicus (rat)
Description:
Cell pellets from SK-N-MC cells transfected with rat H4 receptor were used in binding assay.
Residue:
391
  
Inhibitor
Name:
BDBM26394
Synonyms:
2,4-diamino-5,6-disubstituted pyrimidine, 8 | 4-(piperazin-1-yl)-5H-indeno[1,2-d]pyrimidin-2-amine
Type:
Small organic molecule
Emp. Form.:
C15H17N5
Mol. Mass.:
267.329
SMILES:
Nc1nc-2c(Cc3ccccc-23)c(n1)N1CCNCC1
:
Substrate
Name:
BDBM7966
Synonyms:
2-(1H-imidazol-4-yl)ethan-1-amine CHEMBL90 Ergotidine Histamine Peremin | [3H]histamine
Type:
Small organic molecule
Emp. Form.:
C5H9N3
Mol. Mass.:
111.1451
SMILES:
NCCc1cnc[nH]1
: