Target
Platelet glycoprotein 4
Ligand
BDBM50395028
Substrate
Meas. Tech.
Receptor Binding Assay with 125I-Ghrelin
pH
7.3±n/a
IC50
17400±n/a nM
Comments
extracted
Citation
 Ong, HChemtob, SLubell, WSennlaub, FBoeglin, DProulx, CSajjadi, ZSabatino, D Azapeptides as CD36 binding compounds US Patent  US9708370 Publication Date 7/18/2017 
Target
Name:
Platelet glycoprotein 4
Synonyms:
Adipocyte membrane protein CD_antigen=CD36 Fat Fatty acid transport protein GPIV PAS IV Platelet glycoprotein IV
Type:
PROTEIN
Mol. Mass.:
52740.95
Organism:
Rattus norvegicus
Description:
ChEMBL_858884
Residue:
472
  
Inhibitor
Name:
BDBM50395028
Synonyms:
CHEMBL2163440 | US9708370, CP-1B(iv)
Type:
Small organic molecule
Emp. Form.:
C40H52N10O7
Mol. Mass.:
784.9037
SMILES:
C[C@H](N)C(=O)NN(Cc1ccc(O)cc1)C(=O)N[C@@H](C)C(=O)N[C@@H](Cc1c[nH]c2ccccc12)C(=O)N[C@H](Cc1ccccc1)C(=O)N[C@@H](CCCCN)C(N)=O
: