Target
Neutrophil collagenase
Ligand
BDBM26551
Substrate
BDBM23499
Meas. Tech.
MMP Inhibition Assay
pH
7.4±n/a
Temperature
295.15±n/a K
Ki
1300±n/a nM
Citation
 Govinda Rao, BBandarage, UKWang, TCome, JHPerola, EWei, YTian, SKSaunders, JO Novel thiol-based TACE inhibitors: rational design, synthesis, and SAR of thiol-containing aryl sulfonamides. Bioorg Med Chem Lett 17:2250-3 (2007)  
Target
Name:
Neutrophil collagenase
Synonyms:
CLG1 MMP8 Matrix metalloproteinase-8 PMNL collagenase | PMNL-CL
Type:
Enzyme
Mol. Mass.:
53413.48
Organism:
Homo sapiens (Human)
Description:
P22894
Residue:
467
  
Inhibitor
Name:
BDBM26551
Synonyms:
4-(but-2-yn-1-yloxy)-N-methyl-N-(2-sulfanylethyl)benzene-1-sulfonamide | butynyloxy containing compound, 2
Type:
Small organic molecule
Emp. Form.:
C13H17NO3S2
Mol. Mass.:
299.409
SMILES:
CC#CCOc1ccc(cc1)S(=O)(=O)N(C)CCS
:
Substrate
Name:
BDBM23499
Synonyms:
7-methoxycoumarin-PQGL-(3-[2,4-dinitrophenyl]-L-2,3-diaminopropionyl)-AR-OH | Wammp-5
Type:
Fluorogenic substrate
Emp. Form.:
Mol. Mass.:
SMILES:
: