Target
Stromelysin-1
Ligand
BDBM26563
Substrate
MMP Substrate Peptide
Meas. Tech.
Enzyme Inhibition Assay
Ki
3060±n/a nM
Citation
 Lu, ZOtt, GRAnand, RLiu, RQCovington, MBVaddi, KQian, MNewton, RCChrist, DDTrzaskos, JDuan, JJ Potent, selective, orally bioavailable inhibitors of tumor necrosis factor-alpha converting enzyme (TACE): discovery of indole, benzofuran, imidazopyridine and pyrazolopyridine P1' substituents. Bioorg Med Chem Lett 18:1958-62 (2008)  
Target
Name:
Stromelysin-1
Synonyms:
MMP-3 MMP3_HUMAN Matrix metalloproteinase 3 Matrix metalloproteinase-3 (MMP-3) SL-1 Stromelysin 1 | Transin-1
Type:
Enzyme
Mol. Mass.:
53973.13
Organism:
Homo sapiens (Human)
Description:
P08254
Residue:
477
  
Inhibitor
Name:
BDBM26563
Synonyms:
(3R,4R)-4-N-{4-[(2-ethyl-1H-indol-3-yl)methyl]benzene}-3-N-hydroxyoxane-3,4-dicarboxamide | 2-ethyl indole, 19
Type:
Small organic molecule
Emp. Form.:
C24H27N3O4
Mol. Mass.:
421.4889
SMILES:
CCc1[nH]c2ccccc2c1Cc1ccc(cc1)C(=O)N[C@@H]1CCOC[C@@H]1C(=O)NO
:
Substrate
Name:
MMP Substrate Peptide
Synonyms:
Type:
Fluorogenic Peptide
Mol. Mass.:
2468.31
Organism:
Description:
MCA, (7-methoxycoumarin-4-yl)acetyl. Dpa, N-3-(2,4-dinitrophenyl)-L-2,3-diaminopropionyl.
Residue:
23