Target
TGF-beta receptor type-1
Ligand
BDBM387323
Substrate
Meas. Tech.
Biological Assays
IC50
240±n/a nM
Citation
 Borzilleri, RMFink, BEHarikrishnan, LSSankara Warrier, J TGF beta receptor antagonists US Patent  US10292985 Publication Date 5/21/2019 
Target
Name:
TGF-beta receptor type-1
Synonyms:
ALK-5 Activin A receptor type II-like protein kinase of 53kD SKR4 TGF-beta receptor type I TGFBR1 TGFR1_HUMAN Transforming growth factor-beta receptor type I
Type:
enzyme
Mol. Mass.:
55968.24
Organism:
Homo sapiens (Human)
Description:
P36897
Residue:
503
  
Inhibitor
Name:
BDBM387323
Synonyms:
1-methyl-N-[2-(pyridin-2-yl)pyrrolo[2,1-f][1,2,4]triazin-4-yl]-1H-1,3-benzodiazol-6-amine | US10292985, Example 7
Type:
Small organic molecule
Emp. Form.:
C19H15N7
Mol. Mass.:
341.3693
SMILES:
Cn1cnc2ccc(Nc3nc(nn4cccc34)-c3ccccn3)cc12
: