Target
TGF-beta receptor type-1
Ligand
BDBM387325
Substrate
Meas. Tech.
Biological Assays
IC50
5.10±n/a nM
Citation
 Borzilleri, RMFink, BEHarikrishnan, LSSankara Warrier, J TGF beta receptor antagonists US Patent  US10292985 Publication Date 5/21/2019 
Target
Name:
TGF-beta receptor type-1
Synonyms:
ALK-5 Activin A receptor type II-like protein kinase of 53kD SKR4 TGF-beta receptor type I TGFBR1 TGFR1_HUMAN Transforming growth factor-beta receptor type I
Type:
enzyme
Mol. Mass.:
55968.24
Organism:
Homo sapiens (Human)
Description:
P36897
Residue:
503
  
Inhibitor
Name:
BDBM387325
Synonyms:
2-(4-{1H-imidazo[4,5-c]pyridin-1-yl}pyrrolo[2,1-f][1,2,4]triazin-2-yl)pyridine | US10292985, Example 9
Type:
Small organic molecule
Emp. Form.:
C17H11N7
Mol. Mass.:
313.3161
SMILES:
c1cc2c(nc(nn2c1)-c1ccccn1)-n1cnc2cnccc12
: