Target
TGF-beta receptor type-1
Ligand
BDBM387332
Substrate
Meas. Tech.
Biological Assays
IC50
940±n/a nM
Citation
 Borzilleri, RMFink, BEHarikrishnan, LSSankara Warrier, J TGF beta receptor antagonists US Patent  US10292985 Publication Date 5/21/2019 
Target
Name:
TGF-beta receptor type-1
Synonyms:
ALK-5 Activin A receptor type II-like protein kinase of 53kD SKR4 TGF-beta receptor type I TGFBR1 TGFR1_HUMAN Transforming growth factor-beta receptor type I
Type:
enzyme
Mol. Mass.:
55968.24
Organism:
Homo sapiens (Human)
Description:
P36897
Residue:
503
  
Inhibitor
Name:
BDBM387332
Synonyms:
N-[2-(6-methylpyridin-2-yl)pyrrolo[2,1-f][1,2,4]triazin-4-yl]-6-(trifluoromethyl)quinolin-4-amine | US10292985, Example 16
Type:
Small organic molecule
Emp. Form.:
C22H15F3N6
Mol. Mass.:
420.3899
SMILES:
Cc1cccc(n1)-c1nc(Nc2ccnc3ccc(cc23)C(F)(F)F)c2cccn2n1
: