Target
TGF-beta receptor type-2
Ligand
BDBM387333
Substrate
IC50
930±n/a nM
Citation
 Borzilleri, RMFink, BEHarikrishnan, LSSankara Warrier, J TGF beta receptor antagonists US Patent  US10292985 Publication Date 5/21/2019 
Target
Name:
TGF-beta receptor type-2
Synonyms:
TGF-beta receptor type II TGFR2_HUMAN
Type:
PROTEIN
Mol. Mass.:
64559.49
Organism:
Homo sapiens (Human)
Description:
ChEMBL_586859
Residue:
567
  
Inhibitor
Name:
BDBM387333
Synonyms:
N-[2-(6-methylpyridin-2-yl)pyrrolo[2,1-f][1,2,4]triazin-4-yl]-7-(trifluoromethyl)quinolin-4-amine | US10292985, Example 17
Type:
Small organic molecule
Emp. Form.:
C22H15F3N6
Mol. Mass.:
420.3899
SMILES:
Cc1cccc(n1)-c1nc(Nc2ccnc3cc(ccc23)C(F)(F)F)c2cccn2n1
: