Target
TGF-beta receptor type-1
Ligand
BDBM387338
Substrate
Meas. Tech.
Biological Assays
IC50
1.80±n/a nM
Citation
 Borzilleri, RMFink, BEHarikrishnan, LSSankara Warrier, J TGF beta receptor antagonists US Patent  US10292985 Publication Date 5/21/2019 
Target
Name:
TGF-beta receptor type-1
Synonyms:
ALK-5 Activin A receptor type II-like protein kinase of 53kD SKR4 TGF-beta receptor type I TGFBR1 TGFR1_HUMAN Transforming growth factor-beta receptor type I
Type:
enzyme
Mol. Mass.:
55968.24
Organism:
Homo sapiens (Human)
Description:
P36897
Residue:
503
  
Inhibitor
Name:
BDBM387338
Synonyms:
N-{2-[6-(difluoromethyl)pyridin-2-yl]pyrrolo[2,1-f][1,2,4]triazin-4-yl}-7-methoxyquinolin-4-amine | US10292985, Example 21
Type:
Small organic molecule
Emp. Form.:
C22H16F2N6O
Mol. Mass.:
418.3988
SMILES:
COc1ccc2c(Nc3nc(nn4cccc34)-c3cccc(n3)C(F)F)ccnc2c1
: