Target
TGF-beta receptor type-1
Ligand
BDBM387339
Substrate
Meas. Tech.
Biological Assays
IC50
5.80±n/a nM
Citation
 Borzilleri, RMFink, BEHarikrishnan, LSSankara Warrier, J TGF beta receptor antagonists US Patent  US10292985 Publication Date 5/21/2019 
Target
Name:
TGF-beta receptor type-1
Synonyms:
ALK-5 Activin A receptor type II-like protein kinase of 53kD SKR4 TGF-beta receptor type I TGFBR1 TGFR1_HUMAN Transforming growth factor-beta receptor type I
Type:
enzyme
Mol. Mass.:
55968.24
Organism:
Homo sapiens (Human)
Description:
P36897
Residue:
503
  
Inhibitor
Name:
BDBM387339
Synonyms:
N-{2-[6-(difluoromethyl)pyridin-2-yl]pyrrolo[2,1-f][1,2,4]triazin-4-yl}-1,5-napthyridin-4-amine | US10292985, Example 22
Type:
Small organic molecule
Emp. Form.:
C20H13F2N7
Mol. Mass.:
389.3609
SMILES:
FC(F)c1cccc(n1)-c1nc(Nc2ccnc3cccnc23)c2cccn2n1
: