Target
TGF-beta receptor type-2
Ligand
BDBM387347
Substrate
IC50
1660±n/a nM
Citation
 Borzilleri, RMFink, BEHarikrishnan, LSSankara Warrier, J TGF beta receptor antagonists US Patent  US10292985 Publication Date 5/21/2019 
Target
Name:
TGF-beta receptor type-2
Synonyms:
TGF-beta receptor type II TGFR2_HUMAN
Type:
PROTEIN
Mol. Mass.:
64559.49
Organism:
Homo sapiens (Human)
Description:
ChEMBL_586859
Residue:
567
  
Inhibitor
Name:
BDBM387347
Synonyms:
2-(difluoromethyl)-6-(4-{1H-pyrrolo[3,2-c]pyridin-1-yl}pyrrolo[2,1-f][1,2,4]triazin-2-yl)pyridine | US10292985, Example 29
Type:
Small organic molecule
Emp. Form.:
C19H12F2N6
Mol. Mass.:
362.3356
SMILES:
FC(F)c1cccc(n1)-c1nc(-n2ccc3cnccc23)c2cccn2n1
: