Target
TGF-beta receptor type-2
Ligand
BDBM387352
Substrate
IC50
820±n/a nM
Citation
 Borzilleri, RMFink, BEHarikrishnan, LSSankara Warrier, J TGF beta receptor antagonists US Patent  US10292985 Publication Date 5/21/2019 
Target
Name:
TGF-beta receptor type-2
Synonyms:
TGF-beta receptor type II TGFR2_HUMAN
Type:
PROTEIN
Mol. Mass.:
64559.49
Organism:
Homo sapiens (Human)
Description:
ChEMBL_586859
Residue:
567
  
Inhibitor
Name:
BDBM387352
Synonyms:
5-methyl-2-(4-{1H-pyrrolo[3,2-c]pyridin-1-yl}pyrrolo[2,1-f][1,2,4]triazin-2-yl)pyridine | US10292985, Example 34
Type:
Small organic molecule
Emp. Form.:
C19H14N6
Mol. Mass.:
326.3547
SMILES:
Cc1ccc(nc1)-c1nc(-n2ccc3cnccc23)c2cccn2n1
: