Target
Fibroblast growth factor receptor 2
Ligand
BDBM287520
Substrate
Meas. Tech.
Inhibition of FGFR2-Dependent Cell Growth
IC50
0.700±n/a nM
Citation
 Verner, EBrameld, KA Quinolone derivatives as fibroblast growth factor receptor inhibitors US Patent  US10294223 Publication Date 5/21/2019 
Target
Name:
Fibroblast growth factor receptor 2
Synonyms:
BEK FGFR-2 FGFR2 Fibroblast growth factor receptor 2 (FGFR2) KGFR Keratinocyte growth factor receptor VEGF-receptor 2 and Fibroblast growth factor receptor 2
Type:
Enzyme
Mol. Mass.:
92015.45
Organism:
Homo sapiens (Human)
Description:
P21802
Residue:
821
  
Inhibitor
Name:
BDBM287520
Synonyms:
8-(2-((1-acryloylazetidin-3-yl)(methyl)amino)ethyl)-2-amino-6-(2,6-dichloro-3,5-dimethoxyphenyl)pyrido[2,3-d]pyrimidin-7(8H)-one US11078199, Cpd 114 US9815834, Compound 114
Type:
Small organic molecule
Emp. Form.:
C24H26Cl2N6O4
Mol. Mass.:
533.407
SMILES:
COc1cc(OC)c(Cl)c(c1Cl)-c1cc2cnc(N)nc2n(CCN(C)C2CN(C2)C(=O)C=C)c1=O
: