Target
Kappa-type opioid receptor
Ligand
BDBM26932
Substrate
BDBM21865
Meas. Tech.
Radioligand Binding Assay
Ki
655±n/a nM
Citation
 Caldwell, JPMatasi, JJFernandez, XMcLeod, RLZhang, HFawzi, ATulshian, DB Synthesis and structure-activity relationships of N-substituted spiropiperidines as nociceptin receptor ligands: part 2. Bioorg Med Chem Lett 19:1164-7 (2009)  
Target
Name:
Kappa-type opioid receptor
Synonyms:
K-OR-1 Kappa-opioid receptor (KOR) Kappa-type opioid receptor (KOR) OPIATE Kappa OPRK1 kappa opioid receptor (KOR)
Type:
G Protein-Coupled Receptor (GPCR)
Mol. Mass.:
42648.76
Organism:
Homo sapiens (Human)
Description:
P41145
Residue:
380
  
Inhibitor
Name:
BDBM26932
Synonyms:
8-(4,4-dimethyl-1,2,3,4-tetrahydronaphthalen-1-yl)-3-(2-hydroxyethyl)-1-phenyl-1,3,8-triazaspiro[4.5]decan-4-one | spiropiperidine analogue, 53
Type:
Small organic molecule
Emp. Form.:
C27H35N3O2
Mol. Mass.:
433.5857
SMILES:
CC1(C)CCC(N2CCC3(CC2)N(CN(CCO)C3=O)c2ccccc2)c2ccccc12
:
Substrate
Name:
BDBM21865
Synonyms:
(14beta)-17-(cyclopropylmethyl)-18-(1-hydroxy-1-methylethyl)-6-methoxy-18,19-dihydro-4,5-epoxy-6,14-ethenomorphinan-3-ol CHEMBL24995 [3H]-diprenorphine
Type:
radiolabeled ligand
Emp. Form.:
C26H35NO4
Mol. Mass.:
425.5604
SMILES:
[H][C@]12Cc3ccc(O)c4OC5[C@](CCN1CC1CC1)(c34)[C@@]21CCC5(OC)C(C1)C(C)(C)O
: