Target
Carbonic anhydrase 15 [19-324]
Ligand
BDBM26999
Substrate
BDBM10856
Meas. Tech.
CA Inhibition Assay
Ki
65±n/a nM
Citation
 Hilvo, MSalzano, AMInnocenti, AKulomaa, MSScozzafava, AScaloni, AParkkila, SSupuran, CT Cloning, expression, post-translational modifications and inhibition studies on the latest mammalian carbonic anhydrase isoform, CA XV. J Med Chem 52:646-54 (2009)  
Target
Name:
Carbonic anhydrase 15 [19-324]
Synonyms:
CA-XV Ca15 Carbonate dehydratase XV | Carbonic Anhydrase XV
Type:
Enzyme
Mol. Mass.:
33409.51
Organism:
Mus musculus (mouse)
Description:
Mouse cloned isozyme.
Residue:
306
  
Inhibitor
Name:
BDBM26999
Synonyms:
4-(1,1-dioxo-1,2-thiazinan-2-yl)benzene-1-sulfonamide Contravul Sulthiame (SLT) | Sulthiame, 2
Type:
Small organic molecule
Emp. Form.:
C10H14N2O4S2
Mol. Mass.:
290.359
SMILES:
NS(=O)(=O)c1ccc(cc1)N1CCCCS1(=O)=O
:
Substrate
Name:
BDBM10856
Synonyms:
Carbon Dioxide | methanedione
Type:
Small organic molecule
Emp. Form.:
CO2
Mol. Mass.:
44.0095
SMILES:
O=C=O
: